Reaction Details
TargetLysosomal acid glucosylceramidase
LigandBDBM175515
Substrate/Competitorn/a
Meas. Tech.Enzyme Assay
pH4.5±n/a
Ki 440±10 nM
IC50 1070±20 nM
EC50 6900±1500 nM
Commentsextracted
Citation Wustman, BA Method for the treatment of neurological disorders by enhancing the activity of beta-glucocerebrosidase US Patent US9119845 Publication Date 9/1/2015
 
Lysosomal acid glucosylceramidase
Name:Lysosomal acid glucosylceramidase
Type:Enzyme
Mol. Mass.:57628.24
Organism:Mus musculus (Mouse)
Description:P17439
Residue:515
BDBM175515
NameBDBM175515
Synonyms:US9119845, 16
TypeSmall organic molecule
Emp. Form.C12H24N2O3
Mol. Mass.244.3306
SMILESOC[C@@H]1[C@@H](O)[C@H](O)CCN1CC1CCNCC1