Reaction Details
TargetP2Y purinoceptor 1
LigandBDBM50015295
Substrate/Competitorn/a
Meas. Tech.Binding Assay
IC50 6.5±n/a nM
Citation Qiao, JXHu, CHThibeault, C Amino-heteroaryl 7-hydroxy-spiropiperidine indolinyl antagonists of P2Y1 receptor US Patent US9120798 Publication Date 9/1/2015
 
P2Y purinoceptor 1
Name:P2Y purinoceptor 1
Type:Enzyme
Mol. Mass.:42090.25
Organism:Homo sapiens (Human)
Description:P47900
Residue:373
BDBM50015295
NameBDBM50015295
Synonyms:CHEMBL3263075 | US9120798, 12
TypeSmall organic molecule
Emp. Form.C29H32ClN7OS
Mol. Mass.562.129
SMILESCC(C)(C)CN1CCC2(CN(c3c2c(Cl)ccc3O)c2ccccc2Nc2nnc(s2)-c2cnccn2)CC1