Reaction Details
TargetCarbonic anhydrase 1
LigandBDBM178053
Substrate/Competitorn/a
Meas. Tech.CA I and II Esterase Assay
Ki 420.98±84.86 nM
IC50 559.77±0.0 nM
Citation Artunç, TÇetinkaya, YGöçer, HGülçin, Ä°Menzek, ASahin, ESupuran, CT Synthesis of 4-[2-(3,4-dimethoxybenzyl)cyclopentyl]-1,2-dimethoxybenzene Derivatives and Evaluations of Their Carbonic Anhydrase Isoenzymes Inhibitory Effects. Chem Biol Drug Des87:594-607 (2016) 
 
Carbonic anhydrase 1
Name:Carbonic anhydrase 1
Type:Enzyme
Mol. Mass.:28873.37
Organism:Homo sapiens (Human)
Description:P00915
Residue:261
BDBM178053
NameBDBM178053
Synonyms:4-[2-(3,4-Dimethoxybenzyl)cyclopentyl]-1,2-dimethoxybenzene (17)
TypeSmall organic molecule
Emp. Form.C22H28O4
Mol. Mass.356.4553
SMILESCOc1ccc(CC2CCCC2c2ccc(OC)c(OC)c2)cc1OC