Reaction Details
TargetCarbonic anhydrase 2
LigandBDBM178046
Substrate/Competitorn/a
Meas. Tech.CA I and II Esterase Assay
Ki 1927.31±75.46 nM
IC50 696.62±0.0 nM
Citation Artunç, TÇetinkaya, YGöçer, HGülçin, Ä°Menzek, ASahin, ESupuran, CT Synthesis of 4-[2-(3,4-dimethoxybenzyl)cyclopentyl]-1,2-dimethoxybenzene Derivatives and Evaluations of Their Carbonic Anhydrase Isoenzymes Inhibitory Effects. Chem Biol Drug Des87:594-607 (2016) 
 
Carbonic anhydrase 2
Name:Carbonic anhydrase 2
Type:Enzyme
Mol. Mass.:29250.71
Organism:Homo sapiens (Human)
Description:P00918
Residue:260
BDBM178046
NameBDBM178046
Synonyms:1,6-bis(3,4-dimethoxyphenyl)hexane-1,6-diol (9)
TypeSmall organic molecule
Emp. Form.C22H30O6
Mol. Mass.390.47
SMILESCOc1ccc(cc1OC)C(O)CCCCC(O)c1ccc(OC)c(OC)c1