Reaction Details
TargetCarbonic anhydrase 2
LigandBDBM178048
Substrate/Competitorn/a
Meas. Tech.CA I and II Esterase Assay
Ki 228.31±46.92 nM
IC50 599.48±0.0 nM
Citation Artunç, TÇetinkaya, YGöçer, HGülçin, Ä°Menzek, ASahin, ESupuran, CT Synthesis of 4-[2-(3,4-dimethoxybenzyl)cyclopentyl]-1,2-dimethoxybenzene Derivatives and Evaluations of Their Carbonic Anhydrase Isoenzymes Inhibitory Effects. Chem Biol Drug Des87:594-607 (2016) 
 
Carbonic anhydrase 2
Name:Carbonic anhydrase 2
Type:Enzyme
Mol. Mass.:29250.71
Organism:Homo sapiens (Human)
Description:P00918
Residue:260
BDBM178048
NameBDBM178048
Synonyms:(3,4-Dimethoxyphenyl)[2-(3,4-dimethoxyphenyl)cyclopent-1-en-1-yl]methanone (11)
TypeSmall organic molecule
Emp. Form.C22H24O5
Mol. Mass.368.423
SMILESCOc1ccc(cc1OC)C(=O)C1=C(CCC1)c1ccc(OC)c(OC)c1