Reaction Details
TargetCarbonic anhydrase 2
LigandBDBM178059
Substrate/Competitorn/a
Meas. Tech.CA I and II Esterase Assay
Ki 587.64±29 nM
IC50 389.76±0.0 nM
Citation Artunç, TÇetinkaya, YGöçer, HGülçin, Ä°Menzek, ASahin, ESupuran, CT Synthesis of 4-[2-(3,4-dimethoxybenzyl)cyclopentyl]-1,2-dimethoxybenzene Derivatives and Evaluations of Their Carbonic Anhydrase Isoenzymes Inhibitory Effects. Chem Biol Drug Des87:594-607 (2016) 
 
Carbonic anhydrase 2
Name:Carbonic anhydrase 2
Type:Enzyme
Mol. Mass.:29250.71
Organism:Homo sapiens (Human)
Description:P00918
Residue:260
BDBM178059
NameBDBM178059
Synonyms:(3,4-dimethoxyphenyl)[2-(3,4-dimethoxyphenyl)cyclopentyl]methyl 4-nitrobenzoate (23)
TypeSmall organic molecule
Emp. Form.C29H31NO8
Mol. Mass.521.5583
SMILESCOc1ccc(cc1OC)C(OC(=O)c1ccc(cc1)[N+]([O-])=O)C1CCCC1c1ccc(OC)c(OC)c1