Reaction Details
TargetPhospholipase D
LigandBDBM123751
Substrate/Competitorn/a
Meas. Tech.pH-Stat Assay
pH8±n/a
IC50 15500±0.0 nM
Commentsextracted
Citation Djakpa, HKulkarni, ABarrows-Murphy, SMiller, GZhou, WCho, HTörök, BStieglitz, K Identifying New Drug Targets for Potent Phospholipase D Inhibitors: Combining Sequence Alignment, Molecular Docking, and Enzyme Activity/Binding Assays. Chem Biol Drug Des87:714-29 (2016) 
 
Phospholipase D
Name:Phospholipase D
Type:Protein
Mol. Mass.:59647.22
Organism:Streptomyces chromofuscus
Description:Q8KRU5
Residue:556
BDBM123751
NameBDBM123751
Synonyms:1-(2-ethylphenyl)-3-(naphthalen-2-yl)-1H-pyrazolo[3,4-d]pyrimidin-4-amine (9)
TypeSmall organic molecule
Emp. Form.C23H19N5
Mol. Mass.365.4305
SMILESCCc1ccccc1-n1nc(-c2ccc3ccccc3c2)c2c(N)ncnc12