Reaction Details
TargetBeta-lactamase SHV-1
LigandBDBM178189
Substrate/Competitorn/a
Meas. Tech.Cell Free Inhibition Assay
pH7±n/a
Temperature310.15±n/a K
IC50 1043±n/a nM
Commentsextracted
Citation Bulusu, AR Substituted clavulanic acid US Patent US9120808 Publication Date 9/1/2015
 
Beta-lactamase SHV-1
Name:Beta-lactamase SHV-1
Type:Enzyme
Mol. Mass.:31226.68
Organism:Escherichia coli
Description:P0AD63
Residue:286
BDBM178189
NameBDBM178189
Synonyms:US9120808, Example 8 | US9120808, Example 9
TypeSmall organic molecule
Emp. Form.C19H19NO6
Mol. Mass.357.3573
SMILESOCC=CCC1(N2[C@@H](CC2=O)OC1=CC=O)C(=O)OCc1ccccc1