Reaction Details
TargetBeta-lactamase SHV-1
LigandBDBM178197
Substrate/Competitorn/a
Meas. Tech.Cell Free Inhibition Assay
pH7±n/a
Temperature310.15±n/a K
IC50 21303.5±n/a nM
Commentsextracted
Citation Bulusu, AR Substituted clavulanic acid US Patent US9120808 Publication Date 9/1/2015
 
Beta-lactamase SHV-1
Name:Beta-lactamase SHV-1
Type:Enzyme
Mol. Mass.:31226.68
Organism:Escherichia coli
Description:P0AD63
Residue:286
BDBM178197
NameBDBM178197
Synonyms:US9120808, Example 17
TypeSmall organic molecule
Emp. Form.C12H13NO5
Mol. Mass.251.2353
SMILESCOC(=O)C1(CC=C)N2[C@@H](CC2=O)OC1=CC=O