Reaction Details
TargetBeta-lactamase SHV-1
LigandBDBM178145
Substrate/Competitorn/a
Meas. Tech.Cell Free Inhibition Assay
pH7±n/a
Temperature310.15±n/a K
IC50 624.3±n/a nM
Commentsextracted
Citation Bulusu, AR Substituted clavulanic acid US Patent US9120808 Publication Date 9/1/2015
 
Beta-lactamase SHV-1
Name:Beta-lactamase SHV-1
Type:Enzyme
Mol. Mass.:31226.68
Organism:Escherichia coli
Description:P0AD63
Residue:286
BDBM178145
NameBDBM178145
Synonyms:US9120808, Example 27 | US9120808, Example 28
TypeSmall organic molecule
Emp. Form.C24H21NO6
Mol. Mass.419.4266
SMILESOC(=O)C=C1O[C@@H]2CC(=O)N2C1(C\C=C\c1ccccc1)C(=O)OCc1ccccc1