Reaction Details
TargetALK tyrosine kinase receptor [L1196M]
LigandBDBM179804
Substrate/Competitorn/a
Meas. Tech.ALK HTRF Assays
pH7.5±n/a
Temperature298.15±n/a K
IC50 2807±0.0 nM
Commentsextracted
Citation Liu, NWang, YHuang, GJi, CFan, WLi, HCheng, YTian, H Design, synthesis and biological evaluation of 1H-pyrrolo[2,3-b]pyridine and 1H-pyrazolo[3,4-b]pyridine derivatives as c-Met inhibitors. Bioorg Chem65:146-58 (2016) 
 
ALK tyrosine kinase receptor [L1196M]
Name:ALK tyrosine kinase receptor [L1196M]
Type:n/a
Mol. Mass.:176471.13
Organism:Homo sapiens (Human)
Description:Q9UM73[L1196M]
Residue:1620
BDBM179804
NameBDBM179804
Synonyms:3-{[1-(2,6-dichloro-3-fluorophenyl)ethyl]sulfanyl}-5-[1-(piperidin-4-yl)-1H-pyrazol-4-yl]pyridin-2-amine (11b)
TypeSmall organic molecule
Emp. Form.C21H22Cl2FN5S
Mol. Mass.466.402
SMILESCC(Sc1cc(cnc1N)-c1cnn(c1)C1CCNCC1)c1c(Cl)ccc(F)c1Cl