Reaction Details
TargetCyclin-dependent kinase 9
LigandBDBM180828
Substrate/Competitorn/a
Meas. Tech.CDK9/CycT1 Kinase Assay
pH8±n/a
Temperature295.15±n/a K
IC50 3±n/a nM
Commentsextracted
Citation Lücking, UKosemund, DScholz, ALienau, PSiemeister, GBömer, UBohlmann, R Disubstituted 5-fluoro pyrimidine derivatives containing a sulfoximine group US Patent US9133171 Publication Date 9/15/2015
 
Cyclin-dependent kinase 9
Name:Cyclin-dependent kinase 9
Type:Enzyme Subunit
Mol. Mass.:42789.13
Organism:Homo sapiens (Human)
Description:n/a
Residue:372
BDBM180828
NameBDBM180828
Synonyms:US9133171, 33 US9133171, 35
TypeSmall organic molecule
Emp. Form.C20H20F2N4O3S
Mol. Mass.434.46
SMILESCOc1cc(CS(C)(=N)=O)cc(Nc2ncc(F)c(n2)-c2ccc(F)cc2OC)c1