Reaction Details
TargetCyclin-dependent kinase 9
LigandBDBM180832
Substrate/Competitorn/a
Meas. Tech.CDK9/CycT1 Kinase Assay
pH8±n/a
Temperature295.15±n/a K
IC50 4±n/a nM
Commentsextracted
Citation Lücking, UKosemund, DScholz, ALienau, PSiemeister, GBömer, UBohlmann, R Disubstituted 5-fluoro pyrimidine derivatives containing a sulfoximine group US Patent US9133171 Publication Date 9/15/2015
 
Cyclin-dependent kinase 9
Name:Cyclin-dependent kinase 9
Type:Enzyme Subunit
Mol. Mass.:42789.13
Organism:Homo sapiens (Human)
Description:n/a
Residue:372
BDBM180832
NameBDBM180832
Synonyms:US9133171, 37 US9133171, 39
TypeSmall organic molecule
Emp. Form.C20H19F3N4O2S
Mol. Mass.436.451
SMILESCCOc1cc(F)ccc1-c1nc(Nc2cc(F)cc(CS(C)(=N)=O)c2)ncc1F