Reaction Details
TargetReceptor-type tyrosine-protein kinase FLT3
LigandBDBM180866
Substrate/Competitorn/a
Meas. Tech.Inhibition Assay
pH7.5±n/a
Temperature298.15±n/a K
IC50 0.48±n/a nM
Commentsextracted
Citation Reader, JC Aurora and FLT3 kinases modulators US Patent US9133180 Publication Date 9/15/2015
 
Receptor-type tyrosine-protein kinase FLT3
Name:Receptor-type tyrosine-protein kinase FLT3
Type:Enzyme
Mol. Mass.:112888.62
Organism:Homo sapiens (Human)
Description:P36888
Residue:993
BDBM180866
NameBDBM180866
Synonyms:US9133180, 7
TypeSmall organic molecule
Emp. Form.C25H26FN5O2
Mol. Mass.447.5046
SMILESCc1cc(F)c2[nH]ccc2c1-c1nc(C(N)=O)c(o1)-c1ccc(cc1)N1CCNC(C)(C)C1