Reaction Details
Target3-hydroxyacyl-[acyl-carrier-protein] dehydratase FabZ
LigandBDBM24777
Substrate/Competitorn/a
Meas. Tech.FabZ Inhibition Assay
pH7±n/a
Temperature298.15±n/a K
IC50 5.4e+3± 1.4e+3 nM
Commentsextracted
Citation McGillick, BEKumaran, DVieni, CSwaminathan, S ß-Hydroxyacyl-acyl Carrier Protein Dehydratase (FabZ) from Francisella tularensis and Yersinia pestis: Structure Determination, Enzymatic Characterization, and Cross-Inhibition Studies. Biochemistry55:1091-9 (2016) 
 
3-hydroxyacyl-[acyl-carrier-protein] dehydratase FabZ
Name:3-hydroxyacyl-[acyl-carrier-protein] dehydratase FabZ
Synonyms:beta-Hydroxyacyl-acyl carrier protein dehydratase (FtFabZ)
Type:Protein
Mol. Mass.:18151.57
Organism:Francisella tularensis
Description:n/a
Residue:163
BDBM24777
NameBDBM24777
TypeSmall organic molecule
Emp. Form.C10H6O3
Mol. Mass.174.1528
SMILESOc1cccc2C(=O)C=CC(=O)c12