Reaction Details
TargetAlpha-glucosidase MAL12
LigandBDBM181061
Substrate/Competitorn/a
Meas. Tech.In vitro Assay of alpha-Glucosidasee Inhibitory Activity
pH6.8±n/a
IC50 1.019e+4± 1.1e+2 nM
Commentsextracted
Citation Wang, GHe, DLi, XLi, JPeng, Z Design, synthesis and biological evaluation of novel coumarin thiazole derivatives as a-glucosidase inhibitors. Bioorg Chem65:167-74 (2016) 
 
Alpha-glucosidase MAL12
Name:Alpha-glucosidase MAL12
Type:Protein
Mol. Mass.:68084.32
Organism:Saccharomyces cerevisiae
Description:P53341
Residue:584
BDBM181061
NameBDBM181061
Synonyms:(E)-N'-(3,5-Di-tert-butyl-2-hydroxybenzylidene)-4-(2-oxo-2Hchromen-3-yl)thiazole-2-carbohydrazide (7d)
TypeSmall organic molecule
Emp. Form.C28H29N3O4S
Mol. Mass.503.613
SMILESCC(C)(C)c1cc(\C=N\NC(=O)c2nc(cs2)-c2cc3ccccc3oc2=O)c(O)c(c1)C(C)(C)C