Reaction Details
TargetAlpha-glucosidase MAL12
LigandBDBM181062
Substrate/Competitorn/a
Meas. Tech.In vitro Assay of alpha-Glucosidasee Inhibitory Activity
pH6.8±n/a
IC50 6.24e+3± 7e+1 nM
Commentsextracted
Citation Wang, GHe, DLi, XLi, JPeng, Z Design, synthesis and biological evaluation of novel coumarin thiazole derivatives as a-glucosidase inhibitors. Bioorg Chem65:167-74 (2016) 
 
Alpha-glucosidase MAL12
Name:Alpha-glucosidase MAL12
Type:Protein
Mol. Mass.:68084.32
Organism:Saccharomyces cerevisiae
Description:P53341
Residue:584
BDBM181062
NameBDBM181062
Synonyms:(E)-N'-(3,5-Dichloro-2-hydroxybenzylidene)-4-(2-oxo-2Hchromen-3-yl)thiazole-2-carbohydrazide (7e)
TypeSmall organic molecule
Emp. Form.C20H11Cl2N3O4S
Mol. Mass.460.29
SMILESOc1c(Cl)cc(Cl)cc1\C=N\NC(=O)c1nc(cs1)-c1cc2ccccc2oc1=O