Reaction Details
TargetAlpha-glucosidase MAL12
LigandBDBM181065
Substrate/Competitorn/a
Meas. Tech.In vitro Assay of alpha-Glucosidasee Inhibitory Activity
pH6.8±n/a
IC50 2.990e+4± 4.6e+2 nM
Commentsextracted
Citation Wang, GHe, DLi, XLi, JPeng, Z Design, synthesis and biological evaluation of novel coumarin thiazole derivatives as a-glucosidase inhibitors. Bioorg Chem65:167-74 (2016) 
 
Alpha-glucosidase MAL12
Name:Alpha-glucosidase MAL12
Type:Protein
Mol. Mass.:68084.32
Organism:Saccharomyces cerevisiae
Description:P53341
Residue:584
BDBM181065
NameBDBM181065
Synonyms:(E)-N'-(2-Hydroxy-4-methoxybenzylidene)-4-(2-oxo-2Hchromen-3-yl)thiazole-2-carbohydrazide (7i)
TypeSmall organic molecule
Emp. Form.C21H15N3O5S
Mol. Mass.421.426
SMILESCOc1ccc(\C=N\NC(=O)c2nc(cs2)-c2cc3ccccc3oc2=O)c(O)c1