Reaction Details
TargetCytochrome P450 3A4
LigandBDBM181123
Substrate/Competitorn/a
Meas. Tech.n/a
IC50>10000±n/a nM
Citation Bareja, SPJones, SDOblong, JEMills, KJBierman, JC Cosmetic compositions containing substituted azole and methods for improving the appearance of aging skin US Patent US9138393 Publication Date 9/22/2015
 
Cytochrome P450 3A4
Name:Cytochrome P450 3A4
Type:Enzyme
Mol. Mass.:57349.57
Organism:Homo sapiens (Human)
Description:n/a
Residue:503
BDBM181123
NameBDBM181123
Synonyms:US9138393, 6-Chloropurine | US9144538, 6-Chloropurine
TypeSmall organic molecule
Emp. Form.C5H3ClN4
Mol. Mass.154.557
SMILESClc1ncnc2[nH]cnc12