Reaction Details
TargetCytochrome P450 3A4
LigandBDBM7944
Substrate/Competitorn/a
Meas. Tech.n/a
IC50>10000±n/a nM
Citation Bareja, SPJones, SDOblong, JEMills, KJBierman, JC Cosmetic compositions containing substituted azole and methods for improving the appearance of aging skin US Patent US9138393 Publication Date 9/22/2015
 
Cytochrome P450 3A4
Name:Cytochrome P450 3A4
Type:Enzyme
Mol. Mass.:57349.57
Organism:Homo sapiens (Human)
Description:n/a
Residue:503
BDBM7944
NameBDBM7944
Synonyms:1-(1H-imidazol-1-yl)ethan-1-one N-Acetylimidazole US9144538, 1-Acetylimidazole
TypeSmall organic molecule
Emp. Form.C5H6N2O
Mol. Mass.110.1139
SMILESCC(=O)n1ccnc1