Reaction Details
TargetHistamine H4 receptor
LigandBDBM50017674
Substrate/Competitorn/a
Meas. Tech.Histamine H-4 Receptor Binding Assay
IC50 11000±n/a nM
Citation Aberg, AKCiofalo, VB Methods of treatment of histamine H-4 receptor-related pruritus US Patent US9138431 Publication Date 9/22/2015
 
Histamine H4 receptor
Name:Histamine H4 receptor
Type:G Protein-Coupled Receptor (GPCR)
Mol. Mass.:44517.02
Organism:Homo sapiens (Human)
Description:Binding assays were using CHO cells stably expressing hH4R receptors.
Residue:390
BDBM50017674
NameBDBM50017674
Synonyms:(2-Benzhydryloxy-ethyl)-dimethyl-amine 2-(diphenylmethoxy)-N,N-dimethylethanamine Beldin Benadryl CHEMBL657 DIPHENHYDRAMINE Diphen N-[2-(BENZHYDRYLOXY)ETHYL]-N,N-DIMETHYLAMINE US9138431, DIPHENHYDRAMINE (Benadryl) | US9333199, DIPHENHYDRAMINE (Benadryl)
TypeSmall organic molecule
Emp. Form.C17H21NO
Mol. Mass.255.3547
SMILESCN(C)CCOC(c1ccccc1)c1ccccc1