Reaction Details
TargetCannabinoid receptor 1
LigandBDBM181238
Substrate/Competitorn/a
Meas. Tech.CB1 Receptor Binding Protocol
Temperature303.15±n/a K
Ki>1000±n/a nM
Commentsextracted
Citation Moore, II, BMBhattacharjee, HMustafa, S Tri-aryl/heteroaromatic cannabinoids and use thereof US Patent US9139546 Publication Date 9/22/2015
 
Cannabinoid receptor 1
Name:Cannabinoid receptor 1
Type:G Protein-Coupled Receptor (GPCR)
Mol. Mass.:52868.96
Organism:Homo sapiens (Human)
Description:P21554
Residue:472
BDBM181238
NameBDBM181238
Synonyms:US9139546, 25
TypeSmall organic molecule
Emp. Form.C20H16O2
Mol. Mass.288.3398
SMILESCc1cccc(c1)-c1ccc(cc1O)C(=O)c1ccccc1