Reaction Details
TargetCannabinoid receptor 1
LigandBDBM181239
Substrate/Competitorn/a
Meas. Tech.CB1 Receptor Binding Protocol
Temperature303.15±n/a K
Ki 983.3±30.32 nM
Commentsextracted
Citation Moore, II, BMBhattacharjee, HMustafa, S Tri-aryl/heteroaromatic cannabinoids and use thereof US Patent US9139546 Publication Date 9/22/2015
 
Cannabinoid receptor 1
Name:Cannabinoid receptor 1
Type:G Protein-Coupled Receptor (GPCR)
Mol. Mass.:52868.96
Organism:Homo sapiens (Human)
Description:P21554
Residue:472
BDBM181239
NameBDBM181239
Synonyms:US9139546, 26
TypeSmall organic molecule
Emp. Form.C20H16O3
Mol. Mass.304.3392
SMILESCc1cccc(c1)-c1c(O)cc(cc1O)C(=O)c1ccccc1