Reaction Details
TargetCannabinoid receptor 1
LigandBDBM50312841
Substrate/Competitorn/a
Meas. Tech.CB1 Receptor Binding Protocol
Temperature303.15±n/a K
Ki 503±57.97 nM
Commentsextracted
Citation Moore, II, BMBhattacharjee, HMustafa, S Tri-aryl/heteroaromatic cannabinoids and use thereof US Patent US9139546 Publication Date 9/22/2015
 
Cannabinoid receptor 1
Name:Cannabinoid receptor 1
Type:G Protein-Coupled Receptor (GPCR)
Mol. Mass.:52868.96
Organism:Homo sapiens (Human)
Description:P21554
Residue:472
BDBM50312841
NameBDBM50312841
Synonyms:CHEMBL1081609 [11C](3',5'-dichloro-2-hydroxy-6-methoxybiphenyl-4-yl)(thiophen-2-yl)methanone
TypeSmall organic molecule
Emp. Form.C18H12Cl2O3S
Mol. Mass.379.257
SMILESCOc1cc(cc(O)c1-c1cc(Cl)cc(Cl)c1)C(=O)c1cccs1