Reaction Details
TargetCannabinoid receptor 1
LigandBDBM181243
Substrate/Competitorn/a
Meas. Tech.CB1 Receptor Binding Protocol
Temperature303.15±n/a K
Ki 46.71±15.73 nM
Commentsextracted
Citation Moore, II, BMBhattacharjee, HMustafa, S Tri-aryl/heteroaromatic cannabinoids and use thereof US Patent US9139546 Publication Date 9/22/2015
 
Cannabinoid receptor 1
Name:Cannabinoid receptor 1
Type:G Protein-Coupled Receptor (GPCR)
Mol. Mass.:52868.96
Organism:Homo sapiens (Human)
Description:P21554
Residue:472
BDBM181243
NameBDBM181243
Synonyms:US9139546, 40
TypeSmall organic molecule
Emp. Form.C22H22O2
Mol. Mass.318.4089
SMILESCc1cccc(c1)-c1c(O)cc(cc1O)C(C)(C)c1ccccc1