Reaction Details
TargetCannabinoid receptor 1
LigandBDBM50248606
Substrate/Competitorn/a
Meas. Tech.CB1 Receptor Binding Protocol
Temperature303.15±n/a K
Ki 93.66±2.33 nM
Commentsextracted
Citation Moore, II, BMBhattacharjee, HMustafa, S Tri-aryl/heteroaromatic cannabinoids and use thereof US Patent US9139546 Publication Date 9/22/2015
 
Cannabinoid receptor 1
Name:Cannabinoid receptor 1
Type:G Protein-Coupled Receptor (GPCR)
Mol. Mass.:52868.96
Organism:Homo sapiens (Human)
Description:P21554
Residue:472
BDBM50248606
NameBDBM50248606
Synonyms:3',5'-dichloro-4-(2-phenylpropan-2-yl)biphenyl-2,6-diol US9139546, 41
TypeSmall organic molecule
Emp. Form.C21H18Cl2O2
Mol. Mass.373.272
SMILESCC(C)(c1ccccc1)c1cc(O)c(c(O)c1)-c1cc(Cl)cc(Cl)c1