Reaction Details
TargetCannabinoid receptor 1
LigandBDBM181245
Substrate/Competitorn/a
Meas. Tech.CB1 Receptor Binding Protocol
Temperature303.15±n/a K
Ki 3.7±1.59 nM
Commentsextracted
Citation Moore, II, BMBhattacharjee, HMustafa, S Tri-aryl/heteroaromatic cannabinoids and use thereof US Patent US9139546 Publication Date 9/22/2015
 
Cannabinoid receptor 1
Name:Cannabinoid receptor 1
Type:G Protein-Coupled Receptor (GPCR)
Mol. Mass.:52868.96
Organism:Homo sapiens (Human)
Description:P21554
Residue:472
BDBM181245
NameBDBM181245
Synonyms:US9139546, 43
TypeSmall organic molecule
Emp. Form.C20H20O2S
Mol. Mass.324.437
SMILESCc1cccc(c1)-c1c(O)cc(cc1O)C(C)(C)c1cccs1