Reaction Details
TargetCannabinoid receptor 1
LigandBDBM181246
Substrate/Competitorn/a
Meas. Tech.CB1 Receptor Binding Protocol
Temperature303.15±n/a K
Ki 2.33±0.09 nM
Commentsextracted
Citation Moore, II, BMBhattacharjee, HMustafa, S Tri-aryl/heteroaromatic cannabinoids and use thereof US Patent US9139546 Publication Date 9/22/2015
 
Cannabinoid receptor 1
Name:Cannabinoid receptor 1
Type:G Protein-Coupled Receptor (GPCR)
Mol. Mass.:52868.96
Organism:Homo sapiens (Human)
Description:P21554
Residue:472
BDBM181246
NameBDBM181246
Synonyms:US9139546, 44
TypeSmall organic molecule
Emp. Form.C19H16Cl2O2S
Mol. Mass.379.3
SMILESCC(C)(c1cccs1)c1cc(O)c(c(O)c1)-c1cc(Cl)cc(Cl)c1