Reaction Details
TargetCannabinoid receptor 1
LigandBDBM181247
Substrate/Competitorn/a
Meas. Tech.CB1 Receptor Binding Protocol
Temperature303.15±n/a K
Ki 17.18±5.56 nM
Commentsextracted
Citation Moore, II, BMBhattacharjee, HMustafa, S Tri-aryl/heteroaromatic cannabinoids and use thereof US Patent US9139546 Publication Date 9/22/2015
 
Cannabinoid receptor 1
Name:Cannabinoid receptor 1
Type:G Protein-Coupled Receptor (GPCR)
Mol. Mass.:52868.96
Organism:Homo sapiens (Human)
Description:P21554
Residue:472
BDBM181247
NameBDBM181247
Synonyms:US9139546, 45
TypeSmall organic molecule
Emp. Form.C19H16Cl2OS
Mol. Mass.363.301
SMILESCC(C)(c1cccs1)c1ccc(c(O)c1)-c1cc(Cl)cc(Cl)c1