Reaction Details
TargetCannabinoid receptor 2
LigandBDBM181240
Substrate/Competitorn/a
Meas. Tech.CB2 Receptor Binding Protocol
Temperature303.15±n/a K
Ki 224.98±17.35 nM
Commentsextracted
Citation Moore, II, BMBhattacharjee, HMustafa, S Tri-aryl/heteroaromatic cannabinoids and use thereof US Patent US9139546 Publication Date 9/22/2015
 
Cannabinoid receptor 2
Name:Cannabinoid receptor 2
Type:G Protein-Coupled Receptor (GPCR)
Mol. Mass.:39690.94
Organism:Homo sapiens (Human)
Description:P34972
Residue:360
BDBM181240
NameBDBM181240
Synonyms:US9139546, 27
TypeSmall organic molecule
Emp. Form.C21H18O3
Mol. Mass.318.3658
SMILESCOc1cc(cc(O)c1-c1cccc(C)c1)C(=O)c1ccccc1