Reaction Details
TargetCannabinoid receptor 2
LigandBDBM181242
Substrate/Competitorn/a
Meas. Tech.CB2 Receptor Binding Protocol
Temperature303.15±n/a K
Ki 4.7±0.53 nM
Commentsextracted
Citation Moore, II, BMBhattacharjee, HMustafa, S Tri-aryl/heteroaromatic cannabinoids and use thereof US Patent US9139546 Publication Date 9/22/2015
 
Cannabinoid receptor 2
Name:Cannabinoid receptor 2
Type:G Protein-Coupled Receptor (GPCR)
Mol. Mass.:39690.94
Organism:Homo sapiens (Human)
Description:P34972
Residue:360
BDBM181242
NameBDBM181242
Synonyms:US9139546, 39
TypeSmall organic molecule
Emp. Form.C22H22O
Mol. Mass.302.4095
SMILESCc1cccc(c1)-c1ccc(cc1O)C(C)(C)c1ccccc1