Reaction Details
TargetCannabinoid receptor 2
LigandBDBM181245
Substrate/Competitorn/a
Meas. Tech.CB2 Receptor Binding Protocol
Temperature303.15±n/a K
Ki 81.95±1.54 nM
Commentsextracted
Citation Moore, II, BMBhattacharjee, HMustafa, S Tri-aryl/heteroaromatic cannabinoids and use thereof US Patent US9139546 Publication Date 9/22/2015
 
Cannabinoid receptor 2
Name:Cannabinoid receptor 2
Type:G Protein-Coupled Receptor (GPCR)
Mol. Mass.:39690.94
Organism:Homo sapiens (Human)
Description:P34972
Residue:360
BDBM181245
NameBDBM181245
Synonyms:US9139546, 43
TypeSmall organic molecule
Emp. Form.C20H20O2S
Mol. Mass.324.437
SMILESCc1cccc(c1)-c1c(O)cc(cc1O)C(C)(C)c1cccs1