Reaction Details
TargetCytochrome P450 3A4
LigandBDBM181116
Substrate/Competitorn/a
Meas. Tech.In vitro CYP3A4 Inhibition Assay
IC50 10000±n/a nM
Citation Bareja, SPJones, SDOblong, JEMills, KJBierman, JC Cosmetic compositions containing substituted azole and methods for alleviating the signs of photoaged skin US Patent US9144538 Publication Date 9/29/2015
 
Cytochrome P450 3A4
Name:Cytochrome P450 3A4
Type:Enzyme
Mol. Mass.:57349.57
Organism:Homo sapiens (Human)
Description:n/a
Residue:503
BDBM181116
NameBDBM181116
Synonyms:US9138393, Piperine | US9144538, Piperine
TypeSmall organic molecule
Emp. Form.C17H21NO3
Mol. Mass.287.3535
SMILESCCCN(CC)C(=O)\C=C\C=C\c1ccc2OCOc2c1