Reaction Details
TargetCytochrome P450 3A4
LigandBDBM181126
Substrate/Competitorn/a
Meas. Tech.In vitro CYP3A4 Inhibition Assay
IC50>10000±n/a nM
Citation Bareja, SPJones, SDOblong, JEMills, KJBierman, JC Cosmetic compositions containing substituted azole and methods for alleviating the signs of photoaged skin US Patent US9144538 Publication Date 9/29/2015
 
Cytochrome P450 3A4
Name:Cytochrome P450 3A4
Type:Enzyme
Mol. Mass.:57349.57
Organism:Homo sapiens (Human)
Description:n/a
Residue:503
BDBM181126
NameBDBM181126
Synonyms:US9138393, Amitrol | US9144538, Amitrol
TypeSmall organic molecule
Emp. Form.C2H4N4
Mol. Mass.84.08
SMILESNc1nc[nH]n1