Reaction Details
TargetCytochrome P450 3A4
LigandBDBM181133
Substrate/Competitorn/a
Meas. Tech.In vitro CYP3A4 Inhibition Assay
IC50>10000±n/a nM
Citation Bareja, SPJones, SDOblong, JEMills, KJBierman, JC Cosmetic compositions containing substituted azole and methods for alleviating the signs of photoaged skin US Patent US9144538 Publication Date 9/29/2015
 
Cytochrome P450 3A4
Name:Cytochrome P450 3A4
Type:Enzyme
Mol. Mass.:57349.57
Organism:Homo sapiens (Human)
Description:n/a
Residue:503
BDBM181133
NameBDBM181133
Synonyms:US10093658, Compound Allopurinol US11021454, Compound Allopurinol US9144538, Allopurinol
TypeSmall organic molecule
Emp. Form.C5H4N4O
Mol. Mass.136.1115
SMILESOc1ncnc2[nH]ncc12