Reaction Details
TargetOpioid growth factor receptor-like protein 1
LigandBDBM97715
Substrate/Competitorn/a
Meas. Tech.ORL-1 GTPgammaS Binding Assay
pH7.4±n/a
Temperature277.15±n/a K
EC50 686±41 nM
Commentsextracted
Citation Tsuno, NWhitehead, JWYao, J Substituted-quinoxaline-type bridged-piperidine compounds as ORL-1 modulators US Patent US9145408 Publication Date 9/29/2015
 
Opioid growth factor receptor-like protein 1
Name:Opioid growth factor receptor-like protein 1
Type:Protein
Mol. Mass.:51247.53
Organism:Homo sapiens (Human)
Description:Q5TC84
Residue:451
BDBM97715
NameBDBM97715
Synonyms:US8476271, 96 US9145408, 356
TypeSmall organic molecule
Emp. Form.C28H39N3O3
Mol. Mass.465.6276
SMILESOC(=O)c1nc2ccccc2n([C@@H]2C[C@@H]3CC[C@H](C2)N3C2CCCCCCCCCCC2)c1=O