Reaction Details
TargetOpioid growth factor receptor-like protein 1
LigandBDBM182733
Substrate/Competitorn/a
Meas. Tech.ORL-1 GTPgammaS Binding Assay
pH7.4±n/a
Temperature277.15±n/a K
EC50 1667.1±18.4 nM
Commentsextracted
Citation Tsuno, NWhitehead, JWYao, J Substituted-quinoxaline-type bridged-piperidine compounds as ORL-1 modulators US Patent US9145408 Publication Date 9/29/2015
 
Opioid growth factor receptor-like protein 1
Name:Opioid growth factor receptor-like protein 1
Type:Protein
Mol. Mass.:51247.53
Organism:Homo sapiens (Human)
Description:Q5TC84
Residue:451
BDBM182733
NameBDBM182733
Synonyms:US9145408, 360
TypeSmall organic molecule
Emp. Form.C25H31N3O3
Mol. Mass.421.5319
SMILESOC(=O)c1nc2ccccc2n(C2CC3CCC(C2)N3C2CC3CCCC(C3)C2)c1=O