Reaction Details
TargetOpioid growth factor receptor-like protein 1
LigandBDBM182734
Substrate/Competitorn/a
Meas. Tech.ORL-1 GTPgammaS Binding Assay
pH7.4±n/a
Temperature277.15±n/a K
EC50 545±85 nM
Commentsextracted
Citation Tsuno, NWhitehead, JWYao, J Substituted-quinoxaline-type bridged-piperidine compounds as ORL-1 modulators US Patent US9145408 Publication Date 9/29/2015
 
Opioid growth factor receptor-like protein 1
Name:Opioid growth factor receptor-like protein 1
Type:Protein
Mol. Mass.:51247.53
Organism:Homo sapiens (Human)
Description:Q5TC84
Residue:451
BDBM182734
NameBDBM182734
Synonyms:US9145408, 369
TypeSmall organic molecule
Emp. Form.C26H34N4O3
Mol. Mass.450.5732
SMILESN[C@]12CCC[C@H](C[C@@H](C1)n1c3ccccc3nc(C(O)=O)c1=O)N2C1CC2CCCC(C2)C1