Reaction Details
TargetSphingosine 1-phosphate receptor 1
LigandBDBM50313336
Substrate/Competitorn/a
Meas. Tech.35S-GTPgammaS Binding
pH7.4±n/a
Temperature303.15±n/a K
EC50 440±n/a nM
Commentsextracted
Citation Bombrun, ASchwarz, MCrosignani, SCovini, DMarin, D 6-amino-pyrimidine-4-carboxamide derivatives and related compounds which bind to the sphingosine 1-phosphate (S1P) receptor for the treatment of multiple sclerosis US Patent US9150519 Publication Date 10/6/2015
 
Sphingosine 1-phosphate receptor 1
Name:Sphingosine 1-phosphate receptor 1
Type:Enzyme
Mol. Mass.:42836.02
Organism:Homo sapiens (Human)
Description:P21453
Residue:382
BDBM50313336
NameBDBM50313336
Synonyms:6-(cyclohexylamino)-N-(2-methyl-4-sulfamoylphenyl)pyrimidine-4-carboxamide US9150519, 1-18
TypeSmall organic molecule
Emp. Form.C18H23N5O3S
Mol. Mass.389.472
SMILESCc1cc(ccc1NC(=O)c1cc(NC2CCCCC2)ncn1)S(N)(=O)=O