Reaction Details
TargetRibosomal protein S6 kinase alpha-2
LigandBDBM50361855
Substrate/Competitorn/a
Meas. Tech.Kinase Glo Plus Assay
pH7.5±n/a
IC50 4600±n/a nM
Commentsextracted
Citation Boyer, SJGao, DAGuo, XKirrane, Jr., TMSarko, CRSnow, RJSoleymanzadeh, FZhang, Y Heterocyclic compounds containing an indole core US Patent US9150577 Publication Date 10/6/2015
 
Ribosomal protein S6 kinase alpha-2
Name:Ribosomal protein S6 kinase alpha-2
Type:Serine/threonine-protein kinase
Mol. Mass.:83259.46
Organism:Homo sapiens (Human)
Description:n/a
Residue:733
BDBM50361855
NameBDBM50361855
Synonyms:CHEMBL1938768 | US9150577, 9
TypeSmall organic molecule
Emp. Form.C20H20N4O2
Mol. Mass.348.3984
SMILESCC1(C)CNC(=O)c2cc3ccc(cc3n2C1)C(=O)Nc1cccnc1