Reaction Details
TargetRibosomal protein S6 kinase alpha-2
LigandBDBM184227
Substrate/Competitorn/a
Meas. Tech.Kinase Glo Plus Assay
pH7.5±n/a
IC50 4.8±n/a nM
Commentsextracted
Citation Boyer, SJGao, DAGuo, XKirrane, Jr., TMSarko, CRSnow, RJSoleymanzadeh, FZhang, Y Heterocyclic compounds containing an indole core US Patent US9150577 Publication Date 10/6/2015
 
Ribosomal protein S6 kinase alpha-2
Name:Ribosomal protein S6 kinase alpha-2
Type:Serine/threonine-protein kinase
Mol. Mass.:83259.46
Organism:Homo sapiens (Human)
Description:n/a
Residue:733
BDBM184227
NameBDBM184227
Synonyms:US9150577, 87
TypeSmall organic molecule
Emp. Form.C22H18F3N5O2
Mol. Mass.441.4058
SMILESFC(F)(F)Cn1c(NC(=O)c2ccc3cc4C(=O)NCCCn4c3c2)nc2ccccc12