Reaction Details
TargetRibosomal protein S6 kinase alpha-2
LigandBDBM184348
Substrate/Competitorn/a
Meas. Tech.Kinase Glo Plus Assay
pH7.5±n/a
IC50 3.7±n/a nM
Commentsextracted
Citation Boyer, SJGao, DAGuo, XKirrane, Jr., TMSarko, CRSnow, RJSoleymanzadeh, FZhang, Y Heterocyclic compounds containing an indole core US Patent US9150577 Publication Date 10/6/2015
 
Ribosomal protein S6 kinase alpha-2
Name:Ribosomal protein S6 kinase alpha-2
Type:Serine/threonine-protein kinase
Mol. Mass.:83259.46
Organism:Homo sapiens (Human)
Description:n/a
Residue:733
BDBM184348
NameBDBM184348
Synonyms:US9150577, 233
TypeSmall organic molecule
Emp. Form.C24H28N6O3
Mol. Mass.448.5175
SMILESCn1cc(NC(=O)c2ccc3cc4C(=O)NCC(C)(C)n4c3c2)nc1C(=O)NC1CCCC1