Reaction Details
TargetIsoform Alpha-4-2 of Neuronal acetylcholine receptor subunit alpha-4 (Alpha-4-2)
LigandBDBM50171007
Substrate/Competitorn/a
Meas. Tech.Inhibition Assay
Ki 0.19±n/a nM
Citation Carroll, FIOndachi, PWNavarro, HADamaj, MIWoods, JHJutkiewicz, EM Nicotinic receptor compounds US Patent US9150581 Publication Date 10/6/2015
 
Isoform Alpha-4-2 of Neuronal acetylcholine receptor subunit alpha-4 (Alpha-4-2)
Name:Isoform Alpha-4-2 of Neuronal acetylcholine receptor subunit alpha-4 (Alpha-4-2)
Type:Enzyme
Mol. Mass.:70323.63
Organism:Rattus norvegicus (Rat)
Description:P09483-2
Residue:631
BDBM50171007
NameBDBM50171007
Synonyms:4-[5-(7-Aza-bicyclo[2.2.1]hept-2-yl)-2-fluoro-pyridin-3-yl]-benzonitrile US9150581, RTI-7527-155
TypeSmall organic molecule
Emp. Form.C18H16FN3
Mol. Mass.293.3381
SMILESFc1ncc(cc1-c1ccc(cc1)C#N)C1CC2CCC1N2