Reaction Details
TargetIsoform Alpha-4-2 of Neuronal acetylcholine receptor subunit alpha-4 (Alpha-4-2)
LigandBDBM184563
Substrate/Competitorn/a
Meas. Tech.Inhibition Assay
Ki 0.36±n/a nM
Citation Carroll, FIOndachi, PWNavarro, HADamaj, MIWoods, JHJutkiewicz, EM Nicotinic receptor compounds US Patent US9150581 Publication Date 10/6/2015
 
Isoform Alpha-4-2 of Neuronal acetylcholine receptor subunit alpha-4 (Alpha-4-2)
Name:Isoform Alpha-4-2 of Neuronal acetylcholine receptor subunit alpha-4 (Alpha-4-2)
Type:Enzyme
Mol. Mass.:70323.63
Organism:Rattus norvegicus (Rat)
Description:P09483-2
Residue:631
BDBM184563
NameBDBM184563
Synonyms:US9150581, RTI-7527-169
TypeSmall organic molecule
Emp. Form.C18H18FN3O
Mol. Mass.311.3534
SMILESNC(=O)c1cccc(c1)-c1cc(cnc1F)C1CC2CCC1N2