Reaction Details
TargetIsoform Alpha-4-2 of Neuronal acetylcholine receptor subunit alpha-4 (Alpha-4-2)
LigandBDBM50395217
Substrate/Competitorn/a
Meas. Tech.Inhibition Assay
Ki 0.12±n/a nM
Citation Carroll, FIOndachi, PWNavarro, HADamaj, MIWoods, JHJutkiewicz, EM Nicotinic receptor compounds US Patent US9150581 Publication Date 10/6/2015
 
Isoform Alpha-4-2 of Neuronal acetylcholine receptor subunit alpha-4 (Alpha-4-2)
Name:Isoform Alpha-4-2 of Neuronal acetylcholine receptor subunit alpha-4 (Alpha-4-2)
Type:Enzyme
Mol. Mass.:70323.63
Organism:Rattus norvegicus (Rat)
Description:P09483-2
Residue:631
BDBM50395217
NameBDBM50395217
Synonyms:CHEMBL2164667 | US9150581, RTI-7527-168
TypeSmall organic molecule
Emp. Form.C18H18FN3O
Mol. Mass.311.3534
SMILESNC(=O)c1ccc(cc1)-c1cc(cnc1F)C1CC2CCC1N2