Reaction Details
TargetCholesteryl ester transfer protein
LigandBDBM184565
Substrate/Competitorn/a
Meas. Tech.CETP In Vitro Assay
Temperature310.15±n/a K
IC50 18±n/a nM
Commentsextracted
Citation Trieselmann, THamprecht, DWagner, H Furo[3,4-c]quinoline derivatives, medicaments containing such compounds, their use and process for their preparation US Patent US9150583 Publication Date 10/6/2015
 
Cholesteryl ester transfer protein
Name:Cholesteryl ester transfer protein
Type:Enzyme
Mol. Mass.:54751.53
Organism:Homo sapiens (Human)
Description:P11597
Residue:493
BDBM184565
NameBDBM184565
Synonyms:US9150583, 2
TypeSmall organic molecule
Emp. Form.C28H29F3N2O3
Mol. Mass.498.5367
SMILESCC(C)c1nc2CC3(CC3)C[C@H](O)c2c2c1[C@H](OC21CCOCC1)c1ccc(c(c1)C#N)C(F)(F)F