Reaction Details
TargetCholesteryl ester transfer protein
LigandBDBM184568
Substrate/Competitorn/a
Meas. Tech.CETP In Vitro Assay
Temperature310.15±n/a K
IC50 9±n/a nM
Commentsextracted
Citation Trieselmann, THamprecht, DWagner, H Furo[3,4-c]quinoline derivatives, medicaments containing such compounds, their use and process for their preparation US Patent US9150583 Publication Date 10/6/2015
 
Cholesteryl ester transfer protein
Name:Cholesteryl ester transfer protein
Type:Enzyme
Mol. Mass.:54751.53
Organism:Homo sapiens (Human)
Description:P11597
Residue:493
BDBM184568
NameBDBM184568
Synonyms:US9150583, 5
TypeSmall organic molecule
Emp. Form.C27H30F3NO4
Mol. Mass.489.5266
SMILESCC(C)c1nc2[C@H](O)C3(CC3)C[C@H](O)c2c2c1[C@H](OC21CCOCC1)c1ccc(cc1)C(F)(F)F