Reaction Details
TargetGlycylpeptide N-tetradecanoyltransferase
LigandBDBM184848
Substrate/Competitorn/a
Meas. Tech.Enzyme Inhibition Assay
pH7.4±n/a
Temperature298.15±n/a K
IC50 1±n/a nM
Commentsextracted
Citation Brand, SWyatt, PThompson, SSmith, VBayliss, THarrison, JNorcross, NCleghorn, LGilbert, IBrenk, R N-myristoyl transferase inhibitors US Patent US9156811 Publication Date 10/13/2015
 
Glycylpeptide N-tetradecanoyltransferase
Name:Glycylpeptide N-tetradecanoyltransferase
Synonyms:N-myristoyltransferase (NMT1)
Type:Protein
Mol. Mass.:50529.16
Organism:Trypanosoma brucei
Description:Q388H8
Residue:446
BDBM184848
NameBDBM184848
Synonyms:US9156811, DDD85646
TypeSmall organic molecule
Emp. Form.C21H24Cl2N6O2S
Mol. Mass.495.425
SMILESCc1nn(C)c(C)c1N[S+]([O-])(=O)c1c(Cl)cc(cc1Cl)-c1ccnc(c1)N1CCNCC1