Reaction Details
TargetGlycylpeptide N-tetradecanoyltransferase 1
LigandBDBM184848
Substrate/Competitorn/a
Meas. Tech.Enzyme Inhibition Assay
pH7.4±n/a
Temperature298.15±n/a K
IC50 3±n/a nM
Commentsextracted
Citation Brand, SWyatt, PThompson, SSmith, VBayliss, THarrison, JNorcross, NCleghorn, LGilbert, IBrenk, R N-myristoyl transferase inhibitors US Patent US9156811 Publication Date 10/13/2015
 
Glycylpeptide N-tetradecanoyltransferase 1
Name:Glycylpeptide N-tetradecanoyltransferase 1
Type:Enzyme
Mol. Mass.:56814.10
Organism:Homo sapiens (Human)
Description:P30419
Residue:496
BDBM184848
NameBDBM184848
Synonyms:US9156811, DDD85646
TypeSmall organic molecule
Emp. Form.C21H24Cl2N6O2S
Mol. Mass.495.425
SMILESCc1nn(C)c(C)c1N[S+]([O-])(=O)c1c(Cl)cc(cc1Cl)-c1ccnc(c1)N1CCNCC1