Reaction Details
TargetGlycylpeptide N-tetradecanoyltransferase 1
LigandBDBM184988
Substrate/Competitorn/a
Meas. Tech.Enzyme Inhibition Assay
pH7.4±n/a
Temperature298.15±n/a K
IC50 5±n/a nM
Commentsextracted
Citation Brand, SWyatt, PThompson, SSmith, VBayliss, THarrison, JNorcross, NCleghorn, LGilbert, IBrenk, R N-myristoyl transferase inhibitors US Patent US9156811 Publication Date 10/13/2015
 
Glycylpeptide N-tetradecanoyltransferase 1
Name:Glycylpeptide N-tetradecanoyltransferase 1
Type:Enzyme
Mol. Mass.:56814.10
Organism:Homo sapiens (Human)
Description:P30419
Residue:496
BDBM184988
NameBDBM184988
Synonyms:US9156811, DDD90107
TypeSmall organic molecule
Emp. Form.C25H32N4O2S
Mol. Mass.452.612
SMILESCN1CCC(Cc2cccc(c2)-c2ccc(cc2)[S+]([O-])(=O)Nc2c(C)nn(C)c2C)CC1